Sie sind nicht angemeldet.

1

02.05.2010, 15:35

dev-libs/openssl-0.9.8n emerge failed

Hallo,
bei mir lässt sich keine der stabilen openssl-Versionen mehr emergen. Die Fehlermeldung ist immer die gleiche!

Quellcode

1
2
3
4
5
6
7
8
9
10
11
12
13
14
15
16
17
18
19
20
21
22
23
24
25
26
27
28
29
30
31
32
33
34
35
36
37
38
39
40
41
42
43
44
45
46
47
48
49
50
51
52
53
54
55
56
57
58
59
60
61
62
63
64
michi # emerge -uaDNv -j 2 world

These are the packages that would be merged, in order:

Calculating dependencies... done!
[ebuild     U ] dev-libs/openssl-0.9.8n [0.9.8l-r2] USE="sse2 zlib -bindist -gmp -kerberos -test" 0 kB

Total: 1 package (1 upgrade), Size of downloads: 0 kB

Would you like to merge these packages? [Yes/No] 
>>> Verifying ebuild manifests
>>> Emerging (1 of 1) dev-libs/openssl-0.9.8n
...........
...........
..........
i686-pc-linux-gnu-gcc -I../crypto -I.. -I../include  -fPIC -DOPENSSL_PIC -DZLIB -DOPENSSL_THREADS -D_REENTRANT -DDSO_DLFCN -DHAVE_DLFCN_H -DL_ENDIAN -DTERMIO -Wall -DOPENSSL_BN_ASM_PART_WORDS -DOPENSSL_IA32_SSE2 -DSHA1_ASM -DMD5_ASM -DRMD160_ASM -DAES_ASM -O2 -march=native -pipe -fomit-frame-pointer -fno-strict-aliasing -Wa,--noexecstack   -c -o t1_reneg.o t1_reneg.c
i686-pc-linux-gnu-ar  r ../libssl.a s2_meth.o  s2_srvr.o  s2_clnt.o  s2_lib.o  s2_enc.o s2_pkt.o s3_meth.o  s3_srvr.o  s3_clnt.o  s3_lib.o  s3_enc.o s3_pkt.o s3_both.o s23_meth.o s23_srvr.o s23_clnt.o s23_lib.o          s23_pkt.o t1_meth.o   t1_srvr.o t1_clnt.o  t1_lib.o  t1_enc.o d1_meth.o   d1_srvr.o d1_clnt.o  d1_lib.o  d1_pkt.o d1_both.o d1_enc.o ssl_lib.o ssl_err2.o ssl_cert.o ssl_sess.o ssl_ciph.o ssl_stat.o ssl_rsa.o ssl_asn1.o ssl_txt.o ssl_algs.o bio_ssl.o ssl_err.o kssl.o t1_reneg.o
i686-pc-linux-gnu-ar: creating ../libssl.a
i686-pc-linux-gnu-ranlib ../libssl.a || echo Never mind.
make[1]: Leaving directory `/var/tmp/portage/dev-libs/openssl-0.9.8n/work/openssl-0.9.8n/ssl'
make[1]: Entering directory `/var/tmp/portage/dev-libs/openssl-0.9.8n/work/openssl-0.9.8n'
make[2]: Entering directory `/var/tmp/portage/dev-libs/openssl-0.9.8n/work/openssl-0.9.8n'
+ LIBDEPS='-L.  -ldl -lz'
+ SHAREDCMD=i686-pc-linux-gnu-gcc
+ SHAREDFLAGS='-fPIC -DOPENSSL_PIC -DZLIB -DOPENSSL_THREADS -D_REENTRANT -DDSO_DLFCN -DHAVE_DLFCN_H -DL_ENDIAN -DTERMIO -Wall -DOPENSSL_BN_ASM_PART_WORDS -DOPENSSL_IA32_SSE2 -DSHA1_ASM -DMD5_ASM -DRMD160_ASM -DAES_ASM -O2 -march=native -pipe -fomit-frame-pointer -fno-strict-aliasing -Wa,--noexecstack -Wl,-O1 -shared -Wl,-Bsymbolic -Wl,-soname=libcrypto.so.0.9.8'
++ uniq
++ for x in '$LIBDEPS'
++ echo -L.
++ grep '^ *-L'
++ sed -e 's/^ *-L//'
++ echo -L.
++ for x in '$LIBDEPS'
++ grep '^ *-L'
++ echo -ldl
++ for x in '$LIBDEPS'
++ grep '^ *-L'
++ echo -lz
+ LIBPATH=.
++ sed -e 's/ /:/g'
++ echo .
+ LIBPATH=.
+ LD_LIBRARY_PATH=.:
+ i686-pc-linux-gnu-gcc -fPIC -DOPENSSL_PIC -DZLIB -DOPENSSL_THREADS -D_REENTRANT -DDSO_DLFCN -DHAVE_DLFCN_H -DL_ENDIAN -DTERMIO -Wall -DOPENSSL_BN_ASM_PART_WORDS -DOPENSSL_IA32_SSE2 -DSHA1_ASM -DMD5_ASM -DRMD160_ASM -DAES_ASM -O2 -march=native -pipe -fomit-frame-pointer -fno-strict-aliasing -Wa,--noexecstack -Wl,-O1 -shared -Wl,-Bsymbolic -Wl,-soname=libcrypto.so.0.9.8 -o libcrypto.so.0.9.8 -Wl,--whole-archive libcrypto.a -Wl,--no-whole-archive -L. -ldl -lz
libcrypto.a: member libcrypto.a(md4_dgst.o) in archive is not an object
collect2: ld gab 1 als Ende-Status zurück
make[2]: *** [link_a.gnu] Fehler 1
make[2]: Leaving directory `/var/tmp/portage/dev-libs/openssl-0.9.8n/work/openssl-0.9.8n'
make[1]: *** [do_linux-shared] Fehler 2
make[1]: Leaving directory `/var/tmp/portage/dev-libs/openssl-0.9.8n/work/openssl-0.9.8n'
make: *** [libcrypto.so.0.9.8] Fehler 2
 * ERROR: dev-libs/openssl-0.9.8n failed:
 *   make all failed
 * 
 * Call stack:
 *     ebuild.sh, line  48:  Called src_compile
 *   environment, line 2646:  Called die
 * The specific snippet of code:
 *       emake -j1 all rehash || die "make all failed"
 * 
 * If you need support, post the output of 'emerge --info =dev-libs/openssl-0.9.8n',
 * the complete build log and the output of 'emerge -pqv =dev-libs/openssl-0.9.8n'.
 * The complete build log is located at '/var/tmp/portage/dev-libs/openssl-0.9.8n/temp/build.log'.
 * The ebuild environment file is located at '/var/tmp/portage/dev-libs/openssl-0.9.8n/temp/environment'.
 * S: '/var/tmp/portage/dev-libs/openssl-0.9.8n/work/openssl-0.9.8n'


Quellcode

1
2
3
4
5
6
7
8
9
10
11
12
13
14
15
16
17
18
19
20
21
22
23
24
25
26
27
28
29
30
31
32
33
34
35
36
37
38
39
40
41
42
43
44
45
46
47
48
49
50
 # emerge --info =dev-libs/openssl-0.9.8n
Portage 2.2_rc62 (default/linux/x86/10.0/desktop, gcc-4.3.4, glibc-2.10.1-r1, 2.6.32-gentoo-r7 i686)
=================================================================
                        System Settings
=================================================================
System uname: Linux-2.6.32-gentoo-r7-i686-Intel-R-_Celeron-R-_M_processor_1.40GHz-with-gentoo-2.0.1
Timestamp of tree: Sun, 02 May 2010 12:30:01 +0000
ccache version 2.4 [enabled]
app-shells/bash:     4.0_p37
dev-java/java-config: 2.1.10
dev-lang/python:     2.6.4-r1
dev-util/ccache:     2.4-r7
dev-util/cmake:      2.6.4-r3
sys-apps/baselayout: 2.0.1
sys-apps/openrc:     0.6.0-r1
sys-apps/sandbox:    2.2
sys-devel/autoconf:  2.13, 2.65
sys-devel/automake:  1.9.6-r3, 1.10.3, 1.11.1
sys-devel/binutils:  2.18-r3
sys-devel/gcc:       4.3.4
sys-devel/gcc-config: 1.4.1
sys-devel/libtool:   2.2.6b
virtual/os-headers:  2.6.30-r1
ACCEPT_KEYWORDS="x86"
ACCEPT_LICENSE="*"
CBUILD="i686-pc-linux-gnu"
CFLAGS="-O2 -march=native -pipe -fomit-frame-pointer"
CHOST="i686-pc-linux-gnu"
CONFIG_PROTECT="/etc /usr/share/X11/xkb /usr/share/config"
CONFIG_PROTECT_MASK="/etc/ca-certificates.conf /etc/env.d /etc/env.d/java/ /etc/fonts/fonts.conf /etc/gconf /etc/gentoo-release /etc/revdep-rebuild /etc/sandbox.d /etc/terminfo"
CXXFLAGS="-O2 -march=native -pipe -fomit-frame-pointer"
DISTDIR="/usr/portage/distfiles"
FEATURES="assume-digests ccache distlocks fixpackages news parallel-fetch preserve-libs protect-owned sandbox sfperms strict unmerge-logs unmerge-orphans userfetch"
GENTOO_MIRRORS="http://de-mirror.org/distro/gentoo/ "
LANG="de_DE.utf8"
LC_ALL="de_DE.utf8"
LDFLAGS="-Wl,-O1"
LINGUAS="de"
MAKEOPTS="-j4"
PKGDIR="/usr/portage/packages"
PORTAGE_CONFIGROOT="/"
PORTAGE_RSYNC_OPTS="--recursive --links --safe-links --perms --times --compress --force --whole-file --delete --stats --timeout=180 --exclude=/distfiles --exclude=/local --exclude=/packages"
PORTAGE_TMPDIR="/var/tmp"
PORTDIR="/usr/portage"
PORTDIR_OVERLAY="/usr/local/portage"
SYNC="rsync://rsync.gentoo.org/gentoo-portage"
USE="X a52 aac acl acpi alsa ao berkdb branding bzip2 cairo cdr cli consolekit cracklib crypt cups cxx dbus divx dri dts dvd dvdr dvdread emboss encode exif fam ffmpeg firefox firefox3 flac fortran gdbm gif glib glitz gnutls gpm hal iconv ipod java javascript jpeg kde laptop lcms ldap libnotify mad mikmod mmx mmxext mng modules mp2 mp3 mp4 mpeg mudflap mysql ncurses nfs nls nptl nptlonly nsplugin ogg opengl openmp pam pango pcre pdf perl png ppds pppd python qt3support qt4 quicktime rar readline reflection rss samba sdl semantic-desktop session spell spl sqlite sse sse2 ssl startup-notification svg sysfs tcpd tiff truetype udev unicode usb vcd vorbis wavpack wmf x264 x86 xcb xine xml xml2 xorg xosd xscreensaver xulrunner xv xvid zlib" ALSA_CARDS="ali5451 als4000 atiixp atiixp-modem bt87x ca0106 cmipci emu10k1 emu10k1x ens1370 ens1371 es1938 es1968 fm801 hda-intel intel8x0 intel8x0m maestro3 trident usb-audio via82xx via82xx-modem ymfpci" ALSA_PCM_PLUGINS="adpcm alaw asym copy dmix dshare dsnoop empty extplug file hooks iec958 ioplug ladspa lfloat linear meter mmap_emul mulaw multi null plug rate route share shm softvol" APACHE2_MODULES="actions alias auth_basic authn_alias authn_anon authn_dbm authn_default authn_file authz_dbm authz_default authz_groupfile authz_host authz_owner authz_user autoindex cache dav dav_fs dav_lock deflate dir disk_cache env expires ext_filter file_cache filter headers include info log_config logio mem_cache mime mime_magic negotiation rewrite setenvif speling status unique_id userdir usertrack vhost_alias" ELIBC="glibc" INPUT_DEVICES="synaptics evdev" KERNEL="linux" LCD_DEVICES="bayrad cfontz cfontz633 glk hd44780 lb216 lcdm001 mtxorb ncurses text" LINGUAS="de" RUBY_TARGETS="ruby18" USERLAND="GNU" VIDEO_CARDS="radeon" XTABLES_ADDONS="quota2 psd pknock lscan length2 ipv4options ipset ipp2p iface geoip fuzzy condition tee tarpit sysrq steal rawnat logmark ipmark dhcpmac delude chaos account" 
Unset:  CPPFLAGS, CTARGET, EMERGE_DEFAULT_OPTS, FFLAGS, INSTALL_MASK, PORTAGE_COMPRESS, PORTAGE_COMPRESS_FLAGS, PORTAGE_RSYNC_EXTRA_OPTS

satellite michi #


Woran kann das denn liegen?
Ich wollte auch die build.log hoch laden, leider kommt immer die Fehlermeldung, dass die datei zu groß sei. Dabei hat sie nur 300kib, komisch.
Wenn ihr sie braucht schick ich sie per PM.

Ich danke euch.

Viele Grüße

Michi

Dieser Beitrag wurde bereits 1 mal editiert, zuletzt von »Michi« (08.05.2010, 17:06)


2

02.05.2010, 16:28

Hi Michi

Würde es klappen wenn du emerge nicht mit zwei Jobs startest?
Ansonsten bringe dein portage bitte auch auf einen aktuellen stand, aktuell gibt es doch schon portage-2.2_rc67

...................................................................................................

Zitat von »Michi«

Ich wollte auch die build.log hoch laden, leider kommt immer die Fehlermeldung, dass die datei zu groß sei. Dabei hat sie nur 300kib, komisch.
Dies könnte zb daran liegen dass das Forum die Datei aufgrund der Rechte nicht lesen darf, da würde es dann auch zu dieser Fehlermeldung kommen.
(vermutlich ist dein User nicht in der Gruppe "portage" ?)
Ansonsten sollte ein "chmod 755 Datei" weiterhelfen.

3

02.05.2010, 16:53

Ich habe portage aktualisiert.

Quellcode

1
2
3
4
5
sys-apps/portage
     Available versions:  [P]2.1.6.7 2.1.6.13 2.1.7.17 2.1.8.3 {M}~2.2_rc62 {M}(~)2.2_rc67 {M}**9999 {build doc epydoc linguas_pl python3 selinux}
     Installed versions:  2.2_rc67(16:43:23 02.05.2010)(-build -doc -epydoc -linguas_pl -python3 -selinux)
     Homepage:            [url]http://www.gentoo.org/proj/en/portage/index.xml[/url]
     Description:         Portage is the package management and distribution system for Gentoo


Dann habe ich emerge ohne "-j 2" durchlaufen lassen, leider keine Besserung.

Quellcode

1
2
3
4
5
6
7
8
9
10
11
12
13
14
15
16
17
18
19
20
21
22
23
24
25
26
27
28
29
30
31
32
33
34
35
36
37
38
39
40
41
42
43
44
45
46
47
48
49
50
51
52
53
54
55
56
57
58
59
60
61
62
63
64
65
66
67
68
69
70
71
72
73
74
75
76
77
78
79
80
81
82
83
84
85
86
87
michi # emerge -uaDNv world

These are the packages that would be merged, in order:

Calculating dependencies... done!
[ebuild     U ] dev-libs/openssl-0.9.8n [0.9.8l-r2] USE="sse2 zlib -bindist -gmp -kerberos -test" 0 kB

Total: 1 package (1 upgrade), Size of downloads: 0 kB

Would you like to merge these packages? [Yes/No] 

>>> Verifying ebuild manifests

>>> Emerging (1 of 1) dev-libs/openssl-0.9.8n
 * openssl-0.9.8n.tar.gz RMD160 SHA1 SHA256 size ;-) ...  
........
........
........
i686-pc-linux-gnu-ar  r ../libssl.a s2_meth.o  s2_srvr.o  s2_clnt.o  s2_lib.o  s2_enc.o s2_pkt.o s3_meth.o  s3_srvr.o  s3_clnt.o  s3_lib.o  s3_enc.o s3_pkt.o s3_both.o s23_meth.o s23_srvr.o s23_clnt.o s23_lib.o          s23_pkt.o t1_meth.o   t1_srvr.o t1_clnt.o  t1_lib.o  t1_enc.o d1_meth.o   d1_srvr.o d1_clnt.o  d1_lib.o  d1_pkt.o d1_both.o d1_enc.o ssl_lib.o ssl_err2.o ssl_cert.o ssl_sess.o ssl_ciph.o ssl_stat.o ssl_rsa.o ssl_asn1.o ssl_txt.o ssl_algs.o bio_ssl.o ssl_err.o kssl.o t1_reneg.o
i686-pc-linux-gnu-ar: creating ../libssl.a
i686-pc-linux-gnu-ranlib ../libssl.a || echo Never mind.
make[1]: Leaving directory `/var/tmp/portage/dev-libs/openssl-0.9.8n/work/openssl-0.9.8n/ssl'
make[1]: Entering directory `/var/tmp/portage/dev-libs/openssl-0.9.8n/work/openssl-0.9.8n'
make[2]: Entering directory `/var/tmp/portage/dev-libs/openssl-0.9.8n/work/openssl-0.9.8n'
+ LIBDEPS='-L.  -ldl -lz'
+ SHAREDCMD=i686-pc-linux-gnu-gcc
+ SHAREDFLAGS='-fPIC -DOPENSSL_PIC -DZLIB -DOPENSSL_THREADS -D_REENTRANT -DDSO_DLFCN -DHAVE_DLFCN_H -DL_ENDIAN -DTERMIO -Wall -DOPENSSL_BN_ASM_PART_WORDS -DOPENSSL_IA32_SSE2 -DSHA1_ASM -DMD5_ASM -DRMD160_ASM -DAES_ASM -O2 -march=native -pipe -fomit-frame-pointer -fno-strict-aliasing -Wa,--noexecstack -Wl,-O1 -shared -Wl,-Bsymbolic -Wl,-soname=libcrypto.so.0.9.8'
++ uniq
++ for x in '$LIBDEPS'
++ grep '^ *-L'
++ echo -L.
++ sed -e 's/^ *-L//'
++ echo -L.
++ for x in '$LIBDEPS'
++ grep '^ *-L'
++ echo -ldl
++ for x in '$LIBDEPS'
++ grep '^ *-L'
++ echo -lz
+ LIBPATH=.
++ sed -e 's/ /:/g'
++ echo .
+ LIBPATH=.
+ LD_LIBRARY_PATH=.:
+ i686-pc-linux-gnu-gcc -fPIC -DOPENSSL_PIC -DZLIB -DOPENSSL_THREADS -D_REENTRANT -DDSO_DLFCN -DHAVE_DLFCN_H -DL_ENDIAN -DTERMIO -Wall -DOPENSSL_BN_ASM_PART_WORDS -DOPENSSL_IA32_SSE2 -DSHA1_ASM -DMD5_ASM -DRMD160_ASM -DAES_ASM -O2 -march=native -pipe -fomit-frame-pointer -fno-strict-aliasing -Wa,--noexecstack -Wl,-O1 -shared -Wl,-Bsymbolic -Wl,-soname=libcrypto.so.0.9.8 -o libcrypto.so.0.9.8 -Wl,--whole-archive libcrypto.a -Wl,--no-whole-archive -L. -ldl -lz
libcrypto.a: member libcrypto.a(md4_dgst.o) in archive is not an object
collect2: ld gab 1 als Ende-Status zurück
make[2]: *** [link_a.gnu] Fehler 1
make[2]: Leaving directory `/var/tmp/portage/dev-libs/openssl-0.9.8n/work/openssl-0.9.8n'
make[1]: *** [do_linux-shared] Fehler 2
make[1]: Leaving directory `/var/tmp/portage/dev-libs/openssl-0.9.8n/work/openssl-0.9.8n'
make: *** [libcrypto.so.0.9.8] Fehler 2
 * ERROR: dev-libs/openssl-0.9.8n failed:
 *   make all failed
 * 
 * Call stack:
 *     ebuild.sh, line  48:  Called src_compile
 *   environment, line 2646:  Called die
 * The specific snippet of code:
 *       emake -j1 all rehash || die "make all failed"
 * 
 * If you need support, post the output of 'emerge --info =dev-libs/openssl-0.9.8n',
 * the complete build log and the output of 'emerge -pqv =dev-libs/openssl-0.9.8n'.
 * The complete build log is located at '/var/tmp/portage/dev-libs/openssl-0.9.8n/temp/build.log'.
 * The ebuild environment file is located at '/var/tmp/portage/dev-libs/openssl-0.9.8n/temp/environment'.
 * S: '/var/tmp/portage/dev-libs/openssl-0.9.8n/work/openssl-0.9.8n'

>>> Failed to emerge dev-libs/openssl-0.9.8n, Log file:

>>>  '/var/tmp/portage/dev-libs/openssl-0.9.8n/temp/build.log'

 * Messages for package dev-libs/openssl-0.9.8n:

 * ERROR: dev-libs/openssl-0.9.8n failed:
 *   make all failed
 * 
 * Call stack:
 *     ebuild.sh, line  48:  Called src_compile
 *   environment, line 2646:  Called die
 * The specific snippet of code:
 *       emake -j1 all rehash || die "make all failed"
 * 
 * If you need support, post the output of 'emerge --info =dev-libs/openssl-0.9.8n',
 * the complete build log and the output of 'emerge -pqv =dev-libs/openssl-0.9.8n'.
 * The complete build log is located at '/var/tmp/portage/dev-libs/openssl-0.9.8n/temp/build.log'.
 * The ebuild environment file is located at '/var/tmp/portage/dev-libs/openssl-0.9.8n/temp/environment'.
 * S: '/var/tmp/portage/dev-libs/openssl-0.9.8n/work/openssl-0.9.8n'


P.S. Dass ich die Datei nicht hochladen konnte lag an den Rechten. ein "chmod 755 ..." hat geholfen. Danke Joseph

Michi
»Michi« hat folgende Datei angehängt:
  • build.txt (309,23 kB - 3 mal heruntergeladen - zuletzt: 04.05.2010, 23:08)

4

04.05.2010, 23:08

Schick mir doch die beim Kompiliervorgang erstellte libcrypto.a
"Erst nachdem wir alles verloren haben, haben wir die Freiheit, alles zu tun."
"It's only after we've lost everything, that we're free to do anything!"

Jabber: Die ID kann via PN erfragt werden.

5

04.05.2010, 23:12

Brauchst nicht schicken.
Deaktiviere ccache, dann sollte es funktionieren.
"Erst nachdem wir alles verloren haben, haben wir die Freiheit, alles zu tun."
"It's only after we've lost everything, that we're free to do anything!"

Jabber: Die ID kann via PN erfragt werden.

6

08.05.2010, 17:05

Danke,
ohne ccache hat es nun funktioniert. Woran hast du das denn gesehen, dass es mit nicht funktioniert?

Viele Grüße

Michi

7

09.05.2010, 19:01

"in archive is not an object" -- mit ccache nicht ganz unüblich
"Erst nachdem wir alles verloren haben, haben wir die Freiheit, alles zu tun."
"It's only after we've lost everything, that we're free to do anything!"

Jabber: Die ID kann via PN erfragt werden.

8

10.05.2010, 09:27

OK, werde ich mir merken. Vielen Dank.